Video Teratas
Pencarian Teratas
Baru Dilihat
Suasana & Genre
Autumn
Chill
Commute
Energize
Feel good
Focus
Gaming
Party
Romance
Sad
Sleep
Summer
Winter
Workout
African
Arabic
Blues
Bollywood & Indian
Classical
Country & Americana
Dance & electronic
Decades
Family
Folk & acoustic
German hip-hop
German pop
Hip-hop
Indie & alternative
J-Pop
Jazz
K-Pop
Latin
Mandopop & cantopop
Metal
Pop
R&B & soul
Reggae & caribbean
Rock
Schlager
Soundtracks & musicals
Akun Saya
Masuk
Daftar Putar Saya
Statistik Saya
Unggah
Blog
NodeJS : code ELIFECYCLE error When installing expo-cli
1:22
|
Memproses video...
Memuat...
Unduh
Video Berikutnya
NodeJS : ERROR: code ELIFECYCLE npm ERR! errno 134
1:23
|
Video Terkait
1:23
NodeJS : ERROR: code ELIFECYCLE npm ERR! errno 134
4:42
ERR! code ELIFECYCLE | react native | ERR! errno 1
1:40
undefined npm ERR code ELIFECYCLE Please assist NPM error webdriverIO
2:45
Error: ENOENT: no such file or directory, scandir '**/node_modules/node-sass/vendor'
1:09
NodeJS : error: This is probably not a problem with npm. There is likely additional logging output a
0:43
Solving error Invalid regular expression in 'react-native start' #26603
1:24
Windows : npm install with error: `gyp` failed with exit code: 1
1:30
NodeJS : node.js SyntaxError: Invalid or unexpected token
1:30
NodeJS : Error: EACCES: permission denied, mkdir '/usr/local/lib/node_modules/node-sass/build'
1:21
NodeJS : WARN deprecated
[email protected]
: request has been deprecated, npm WARN deprecated har-valida
6:02
npm error No test specified && exit 1 In Web Driver IO Resolved
1:04
NodeJS : How to fix "FATAL ERROR: Ineffective mark-compacts near heap limit Allocation failed - Java
1:13
NodeJS : Nodejs reading file ENAMETOOLONG
0:52
toggle switch for vue js NOT WORKING (Solution)
7:06
How to install Npm Packages for Node.js Dependencies in Termux without Error | Syscall error solve
2:43
How to fix No version of chokidar available | npm start not working
1:18
[solved] how to handle build failed in vercel deployment #Next.js
1:13
taiko installation issue fixed |Unexpected end of Json while parsing|taiko tutorials for beginners
1:33
Fix react scripts is not recognized as an internal or external command